Reaction Details
TargetHistamine H3 receptor
LigandBDBM197113
Substrate/Competitorn/a
Meas. Tech.LANCE Ultra cAMP Assay
Ki 0.2±n/a nM
Citation Wang, TZhang, X Carbamate/urea derivatives containing piperidin and piperazin rings as H3 receptor inhibitors US Patent US9216182 Publication Date 12/22/2015
 
Histamine H3 receptor
Name:Histamine H3 receptor
Type:G Protein-Coupled Receptor (GPCR)
Mol. Mass.:48691.47
Organism:Homo sapiens (Human)
Description:Binding assays were using CHO cells stably expressing hH3R receptors.
Residue:445
BDBM197113
NameBDBM197113
Synonyms:US9216182, 1.59
TypeSmall organic molecule
Emp. Form.C20H30N4O4
Mol. Mass.390.4766
SMILESCOC(=O)c1ccc(cn1)N1CCC(CC1)OC(=O)N1CCN(CC1)C(C)C