Reaction Details
TargetFatty acid-binding protein, liver
LigandBDBM197163
Substrate/CompetitorBDBM60925
Meas. Tech.FABP1 Fluorescent Ligand Displacement Assay
Ki 163± 4 nM
Citation Huang, HMcIntosh, ALMartin, GGLandrock, DChung, SLandrock, KKDangott, LJLi, SKier, ABSchroeder, F FABP1: A Novel Hepatic Endocannabinoid and Cannabinoid Binding Protein. Biochemistry55:5243-55 (2016) 
 
Fatty acid-binding protein, liver
Name:Fatty acid-binding protein, liver
Type:Protein
Mol. Mass.:14247.91
Organism:Mus musculus (Mouse)
Description:n/a
Residue:127
BDBM197163
BDBM60925
NameBDBM197163
Synonyms:Docosahexaenoylethanolamide (DHEA)
TypeSmall organic molecule
Emp. Form.C24H37NO2
Mol. Mass.371.5561
SMILESCCC=CCC=CCC=CCC=CCC=CCC=CCCC(=O)NCCO