Reaction Details
TargetFatty acid-binding protein, liver
LigandBDBM197165
Substrate/CompetitorBDBM60925
Meas. Tech.FABP1 Fluorescent Ligand Displacement Assay
Ki 40± 3 nM
Citation Huang, HMcIntosh, ALMartin, GGLandrock, DChung, SLandrock, KKDangott, LJLi, SKier, ABSchroeder, F FABP1: A Novel Hepatic Endocannabinoid and Cannabinoid Binding Protein. Biochemistry55:5243-55 (2016) 
 
Fatty acid-binding protein, liver
Name:Fatty acid-binding protein, liver
Type:Protein
Mol. Mass.:14247.91
Organism:Mus musculus (Mouse)
Description:n/a
Residue:127
BDBM197165
BDBM60925
NameBDBM197165
Synonyms:2-Oleoylmonoglycerol (2-OG)
TypeSmall organic molecule
Emp. Form.C21H40O4
Mol. Mass.356.5399
SMILESCCCCCCCC\C=C/CCCCCCCC(=O)OC(CO)CO