Reaction Details
TargetNicotinamide N-methyltransferase
LigandBDBM50047015
Substrate/Competitorn/a
Meas. Tech.NNMT Enzymatic Activity Assay
pH8.6±n/a
Temperature310.15±n/a K
Ki 102000000±33000000 nM
Commentsextracted
Citation van Haren, MJSastre Toraņo, JSartini, DEmanuelli, MParsons, RBMartin, NI A Rapid and Efficient Assay for the Characterization of Substrates and Inhibitors of Nicotinamide N-Methyltransferase. Biochemistry55:5307-15 (2016) 
 
Nicotinamide N-methyltransferase
Name:Nicotinamide N-methyltransferase
Type:Protein
Mol. Mass.:29571.16
Organism:Homo sapiens (Human)
Description:n/a
Residue:264
BDBM50047015
NameBDBM50047015
Synonyms:CHEMBL14474 benzo[b]pyridine | quinoline
TypeSmall organic molecule
Emp. Form.C9H7N
Mol. Mass.129.1586
SMILESc1ccc2ncccc2c1