Reaction Details
TargetNicotinamide N-methyltransferase
LigandBDBM13016
Substrate/Competitorn/a
Meas. Tech.NNMT Enzymatic Activity Assay
pH8.6±n/a
Temperature310.15±n/a K
Ki 47000000±12000000 nM
Commentsextracted
Citation van Haren, MJSastre Toraņo, JSartini, DEmanuelli, MParsons, RBMartin, NI A Rapid and Efficient Assay for the Characterization of Substrates and Inhibitors of Nicotinamide N-Methyltransferase. Biochemistry55:5307-15 (2016) 
 
Nicotinamide N-methyltransferase
Name:Nicotinamide N-methyltransferase
Type:Protein
Mol. Mass.:29571.16
Organism:Homo sapiens (Human)
Description:n/a
Residue:264
BDBM13016
NameBDBM13016
Synonyms:1,2,3,4-tetrahydroisoquinoline THIQ 6 | tetrahydroisoquinoline
TypeSmall organic molecule
Emp. Form.C9H11N
Mol. Mass.133.1903
SMILESC1Cc2ccccc2CN1