Reaction Details
TargetNicotinamide N-methyltransferase
LigandBDBM197173
Substrate/Competitorn/a
Meas. Tech.NNMT Enzymatic Activity Assay
pH8.6±n/a
Temperature310.15±n/a K
IC50 3.9e+3± 3e+2 nM
Commentsextracted
Citation van Haren, MJSastre Toraņo, JSartini, DEmanuelli, MParsons, RBMartin, NI A Rapid and Efficient Assay for the Characterization of Substrates and Inhibitors of Nicotinamide N-Methyltransferase. Biochemistry55:5307-15 (2016) 
 
Nicotinamide N-methyltransferase
Name:Nicotinamide N-methyltransferase
Type:Protein
Mol. Mass.:29571.16
Organism:Homo sapiens (Human)
Description:n/a
Residue:264
BDBM197173
NameBDBM197173
Synonyms:Sinefungin
TypeSmall organic molecule
Emp. Form.C15H24N7O5
Mol. Mass.382.3944
SMILESNc1ncnc2n(cnc12)[C@@H]1O[C@H](C[C@@H]([NH3+])CC[C@H]([NH3+])C([O-])=O)[C@@H](O)[C@H]1O