Reaction Details
TargetTyrosine-protein kinase BTK
LigandBDBM197266
Substrate/Competitorn/a
Meas. Tech.Enzymatic Activity Assay
Temperature298.15±n/a K
IC50 1.0±n/a nM
Commentsextracted
Citation Goldstein, DM Tyrosine kinase inhibitors US Patent US9090621 Publication Date 7/28/2015
 
Tyrosine-protein kinase BTK
Name:Tyrosine-protein kinase BTK
Type:Enzyme
Mol. Mass.:76289.95
Organism:Homo sapiens (Human)
Description:Q06187
Residue:659
BDBM197266
NameBDBM197266
Synonyms:US9090621, 175B
TypeSmall organic molecule
Emp. Form.C33H36N6O2
Mol. Mass.548.6779
SMILESCC(C)C(C)(C)C=C(C#N)C(=O)N1CCC[C@@H]1Cn1cc(-c2ccc(Oc3ccccc3)cc2)c2c(N)ncnc12