Reaction Details
TargetHistone deacetylase 6 [25-831]
LigandBDBM197337
Substrate/Competitorn/a
Meas. Tech.HDAC activity assays
IC50 9.88±1.01 nM
Citation Miyake, YKeusch, JJWang, LSaito, MHess, DWang, XMelancon, BJHelquist, PGut, HMatthias, P Structural insights into HDAC6 tubulin deacetylation and its selective inhibition. Nat Chem Biol12:748-54 (2016) 
 
Histone deacetylase 6 [25-831]
Name:Histone deacetylase 6 [25-831]
Synonyms:HDAC6 (CD1-CD2)
Type:n/a
Mol. Mass.:89087.42
Organism:Danio rerio (Zebrafish)
Description:F8W4B7 25-831 aa
Residue:807
BDBM197337
NameBDBM197337
Synonyms:S-TSA
TypeSmall organic molecule
Emp. Form.C17H22N2O3
Mol. Mass.302.3682
SMILESC[C@@H](\C=C\C(=O)NO)\C=C(/C)C(=O)c1ccc(cc1)N(C)C