Reaction Details
TargetHistone deacetylase 3
LigandBDBM197337
Substrate/Competitorn/a
Meas. Tech.HDAC activity assays
IC50 320.8±27.01 nM
Citation Miyake, YKeusch, JJWang, LSaito, MHess, DWang, XMelancon, BJHelquist, PGut, HMatthias, P Structural insights into HDAC6 tubulin deacetylation and its selective inhibition. Nat Chem Biol12:748-54 (2016) 
 
Histone deacetylase 3
Name:Histone deacetylase 3
Type:Enzyme
Mol. Mass.:48829.55
Organism:Homo sapiens (Human)
Description:O15379
Residue:428
BDBM197337
NameBDBM197337
Synonyms:S-TSA
TypeSmall organic molecule
Emp. Form.C17H22N2O3
Mol. Mass.302.3682
SMILESC[C@@H](\C=C\C(=O)NO)\C=C(/C)C(=O)c1ccc(cc1)N(C)C