Reaction Details
TargetHistone deacetylase 7
LigandBDBM197336
Substrate/Competitorn/a
Meas. Tech.HDAC activity assays
IC50 3499.25±123.74 nM
Citation Miyake, YKeusch, JJWang, LSaito, MHess, DWang, XMelancon, BJHelquist, PGut, HMatthias, P Structural insights into HDAC6 tubulin deacetylation and its selective inhibition. Nat Chem Biol12:748-54 (2016) 
 
Histone deacetylase 7
Name:Histone deacetylase 7
Type:Chromatin regulator; hydrolase; repressor
Mol. Mass.:102942.62
Organism:Homo sapiens (Human)
Description:Q8WUI4
Residue:952
BDBM197336
NameBDBM197336
Synonyms:R-TSA
TypeSmall organic molecule
Emp. Form.C17H22N2O3
Mol. Mass.302.3682
SMILESC[C@H](\C=C\C(=O)NO)\C=C(/C)C(=O)c1ccc(cc1)N(C)C