Reaction Details
TargetPolyamine deacetylase HDAC10
LigandBDBM197337
Substrate/Competitorn/a
Meas. Tech.HDAC activity assays
IC50 403.35±10.25 nM
Citation Miyake, YKeusch, JJWang, LSaito, MHess, DWang, XMelancon, BJHelquist, PGut, HMatthias, P Structural insights into HDAC6 tubulin deacetylation and its selective inhibition. Nat Chem Biol12:748-54 (2016) 
 
Polyamine deacetylase HDAC10
Name:Polyamine deacetylase HDAC10
Type:Chromatin regulator; hydrolase; repressor
Mol. Mass.:71431.89
Organism:Homo sapiens (Human)
Description:Q969S8
Residue:669
BDBM197337
NameBDBM197337
Synonyms:S-TSA
TypeSmall organic molecule
Emp. Form.C17H22N2O3
Mol. Mass.302.3682
SMILESC[C@@H](\C=C\C(=O)NO)\C=C(/C)C(=O)c1ccc(cc1)N(C)C