Reaction Details
TargetD(1A) dopamine receptor
LigandBDBM160912
Substrate/Competitorn/a
Meas. Tech.Human D1 Receptor Binding Assay
pH7.4±n/a
Ki 3.11±n/a nM
Commentsextracted
Citation Brodney, MADavoren, JEDounay, ABEfremov, IVGray, DLGreen, MEHenderson, JLLee, CMente, SRO Neil, SVRogers, BNZhang, L Heteroaromatic compounds and their use as dopamine D1 ligands US Patent US10093655 Publication Date 10/9/2018
 
D(1A) dopamine receptor
Name:D(1A) dopamine receptor
Type:Enzyme
Mol. Mass.:49303.43
Organism:Homo sapiens (Human)
Description:P21728
Residue:446
BDBM160912
NameBDBM160912
Synonyms:US10093655, Example 2 US9107923, 1 | US9107923, 2
TypeSmall organic molecule
Emp. Form.C21H21N3O3
Mol. Mass.363.4097
SMILESCc1cc(Oc2ncccc2C2CC2)ccc1-c1c(C)c(=O)[nH]c(=O)n1C