Reaction Details
TargetComplement factor B
LigandBDBM159289
Substrate/Competitorn/a
Meas. Tech.Human Complement Factor B TR-FRET Assay
IC50 0.04±n/a nM
Citation Adams, CMCapparelli, MPEhara, TKarki, RGMainolfi, NZhang, C Piperidinyl-indole derivatives complement factor B inhibitors and uses thereof US Patent US9682968 Publication Date 6/20/2017
 
Complement factor B
Name:Complement factor B
Type:Enzyme
Mol. Mass.:85537.97
Organism:Homo sapiens (Human)
Description:P00751
Residue:764
BDBM159289
NameBDBM159289
Synonyms:US10093663, Example 5-12 | US9682968, Example-5-12
TypeSmall organic molecule
Emp. Form.C23H26N6
Mol. Mass.386.4927
SMILESCc1cc(C)c2[nH]ccc2c1CN1CCCCC1c1ccc(cc1)-c1nn[nH]n1