Reaction Details
TargetComplement factor B
LigandBDBM159932
Substrate/Competitorn/a
Meas. Tech.Human Complement Factor B TR-FRET Assay
IC50 0.16±n/a nM
Citation Adams, CMCapparelli, MPEhara, TKarki, RGMainolfi, NZhang, C Piperidinyl-indole derivatives complement factor B inhibitors and uses thereof US Patent US9682968 Publication Date 6/20/2017
 
Complement factor B
Name:Complement factor B
Type:Enzyme
Mol. Mass.:85537.97
Organism:Homo sapiens (Human)
Description:P00751
Residue:764
BDBM159932
NameBDBM159932
Synonyms:US10093663, Example 17-28 | US9682968, Example-17-28
TypeSmall organic molecule
Emp. Form.C24H28N2O4
Mol. Mass.408.4901
SMILESCOc1cc(C)c2[nH]ccc2c1CN1CCCCC1c1ccc(C(O)=O)c(OC)c1