Reaction Details
TargetComplement factor B
LigandBDBM160507
Substrate/Competitorn/a
Meas. Tech.Human Complement Factor B TR-FRET Assay
IC50 0.17±n/a nM
Citation Adams, CMCapparelli, MPEhara, TKarki, RGMainolfi, NZhang, C Piperidinyl-indole derivatives complement factor B inhibitors and uses thereof US Patent US9682968 Publication Date 6/20/2017
 
Complement factor B
Name:Complement factor B
Type:Enzyme
Mol. Mass.:85537.97
Organism:Homo sapiens (Human)
Description:P00751
Residue:764
BDBM160507
NameBDBM160507
Synonyms:US9682968, Example-41
TypeSmall organic molecule
Emp. Form.C26H33N3O2
Mol. Mass.419.5591
SMILESCCNC(=O)c1ccc(cc1)[C@@H]1C[C@H](C)CCN1Cc1c(OC)cc(C)c2[nH]ccc12