Reaction Details
TargetProstaglandin G/H synthase 1
LigandBDBM198173
Substrate/Competitorn/a
Meas. Tech.In vitro COX Inhibition Assay
IC50 6.244e+4± 3.77e+3 nM
Citation Banerjee, AGDas, NShengule, SASharma, PASrivastava, RSShrivastava, SK Design, synthesis, evaluation and molecular modelling studies of some novel 5,6-diphenyl-1,2,4-triazin-3(2H)-ones bearing five-member heterocyclic moieties as potential COX-2 inhibitors: A hybrid pharmacophore approach. Bioorg Chem69:102-120 (2016) 
 
Prostaglandin G/H synthase 1
Name:Prostaglandin G/H synthase 1
Type:Protein
Mol. Mass.:68868.60
Organism:Ovis aries (Sheep)
Description:n/a
Residue:600
BDBM198173
NameBDBM198173
Synonyms:2-((5-(4-Nitrophenylamino)-1,3,4-oxadiazol-2-yl)methyl)-5,6-diphenyl-1,2,4-triazin-3(2H)-one (3e)
TypeSmall organic molecule
Emp. Form.C24H17N7O4
Mol. Mass.467.4363
SMILES[O-][N+](=O)c1ccc(Nc2nnc(Cn3nc(-c4ccccc4)c(nc3=O)-c3ccccc3)o2)cc1