Reaction Details
TargetHistone deacetylase 11
LigandBDBM25150
Substrate/Competitorn/a
Meas. Tech.In vitro HDACs Inhibition Fluorescence Assay
IC50 25000±8485 nM
Citation Li, JLi, XWang, XHou, JZang, JGao, SXu, WZhang, Y PXD101 analogs with L-phenylglycine-containing branched cap as histone deacetylase inhibitors. Chem Biol Drug Des88:574-84 (2016) 
 
Histone deacetylase 11
Name:Histone deacetylase 11
Type:Chromatin regulator; hydrolase; repressor
Mol. Mass.:39187.66
Organism:Homo sapiens (Human)
Description:Q96DB2
Residue:347
BDBM25150
NameBDBM25150
Synonyms:(2E)-N-hydroxy-3-[3-(phenylsulfamoyl)phenyl]prop-2-enamide Belinostat PXD101
TypeSmall organic molecule
Emp. Form.C15H14N2O4S
Mol. Mass.318.348
SMILESONC(=O)\C=C\c1cccc(c1)S(=O)(=O)Nc1ccccc1