Reaction Details
TargetGlutamate receptor ionotropic, NMDA 2B
LigandBDBM198663
Substrate/Competitorn/a
Meas. Tech.Radioligand Binding Assay
Temperature323.15±n/a K
Ki 3±n/a nM
Commentsextracted
Citation King, DThompson, III, LAShi, JThangathirupathy, SWarrier, JSIslam, IMacor, JE Selective NR2B antagonists US Patent US9221796 Publication Date 12/29/2015
 
Glutamate receptor ionotropic, NMDA 2B
Name:Glutamate receptor ionotropic, NMDA 2B
Type:Protein
Mol. Mass.:166077.66
Organism:Rattus norvegicus (Rat)
Description:Q00960
Residue:1482
BDBM198663
NameBDBM198663
Synonyms:US9221796, 1
TypeSmall organic molecule
Emp. Form.C22H25FN2O2
Mol. Mass.368.4445
SMILESOc1ccc(cc1)C1CCN(CC1)C1CCN(Cc2ccc(F)cc2)C1=O