Reaction Details
TargetGlutamate receptor ionotropic, NMDA 2B
LigandBDBM198672
Substrate/Competitorn/a
Meas. Tech.Radioligand Binding Assay
Temperature323.15±n/a K
Ki 1400±n/a nM
Commentsextracted
Citation King, DThompson, III, LAShi, JThangathirupathy, SWarrier, JSIslam, IMacor, JE Selective NR2B antagonists US Patent US9221796 Publication Date 12/29/2015
 
Glutamate receptor ionotropic, NMDA 2B
Name:Glutamate receptor ionotropic, NMDA 2B
Type:Protein
Mol. Mass.:166077.66
Organism:Rattus norvegicus (Rat)
Description:Q00960
Residue:1482
BDBM198672
NameBDBM198672
Synonyms:BDBM198673 BDBM198675 BDBM198719 US9221796, 8
TypeSmall organic molecule
Emp. Form.C22H25FN2O3
Mol. Mass.384.4439
SMILESOC1CN(CCC1c1ccc(O)cc1)C1CCN(Cc2ccc(F)cc2)C1=O