Reaction Details
TargetGlutamate receptor ionotropic, NMDA 2B
LigandBDBM198772
Substrate/Competitorn/a
Meas. Tech.Radioligand Binding Assay
Temperature323.15±n/a K
Ki 490±n/a nM
Commentsextracted
Citation King, DThompson, III, LAShi, JThangathirupathy, SWarrier, JSIslam, IMacor, JE Selective NR2B antagonists US Patent US9221796 Publication Date 12/29/2015
 
Glutamate receptor ionotropic, NMDA 2B
Name:Glutamate receptor ionotropic, NMDA 2B
Type:Protein
Mol. Mass.:166077.66
Organism:Rattus norvegicus (Rat)
Description:Q00960
Residue:1482
BDBM198772
NameBDBM198772
Synonyms:BDBM198773 | US9221796, 64
TypeSmall organic molecule
Emp. Form.C22H24ClFN2O2
Mol. Mass.402.89
SMILESOc1ccc(cc1)[C@@H]1CCN(C[C@H]1F)[C@H]1CCN(Cc2ccc(Cl)cc2)C1=O