Reaction Details
TargetGlutamate receptor ionotropic, NMDA 2B
LigandBDBM198807
Substrate/Competitorn/a
Meas. Tech.Radioligand Binding Assay
Temperature323.15±n/a K
Ki 18±n/a nM
Commentsextracted
Citation King, DThompson, III, LAShi, JThangathirupathy, SWarrier, JSIslam, IMacor, JE Selective NR2B antagonists US Patent US9221796 Publication Date 12/29/2015
 
Glutamate receptor ionotropic, NMDA 2B
Name:Glutamate receptor ionotropic, NMDA 2B
Type:Protein
Mol. Mass.:166077.66
Organism:Rattus norvegicus (Rat)
Description:Q00960
Residue:1482
BDBM198807
NameBDBM198807
Synonyms:BDBM198823 | US9221796, 96, P-2
TypeSmall organic molecule
Emp. Form.C22H22ClF3N2O2
Mol. Mass.438.87
SMILESOc1ccc(cc1)C1CCN(CC1(F)F)[C@@H]1CCN(Cc2ccc(Cl)c(F)c2)C1=O