Reaction Details
TargetGlutamate receptor ionotropic, NMDA 2B
LigandBDBM198751
Substrate/Competitorn/a
Meas. Tech.Radioligand Binding Assay
Temperature323.15±n/a K
Ki 36±n/a nM
Commentsextracted
Citation King, DThompson, III, LAShi, JThangathirupathy, SWarrier, JSIslam, IMacor, JE Selective NR2B antagonists US Patent US9221796 Publication Date 12/29/2015
 
Glutamate receptor ionotropic, NMDA 2B
Name:Glutamate receptor ionotropic, NMDA 2B
Type:Protein
Mol. Mass.:166077.66
Organism:Rattus norvegicus (Rat)
Description:Q00960
Residue:1482
BDBM198751
NameBDBM198751
Synonyms:BDBM198752 US9221796, 53, P-1
TypeSmall organic molecule
Emp. Form.C23H23F5N2O2
Mol. Mass.454.4329
SMILESOc1ccc(cc1)C1CCN(CC1(F)F)C1CCN(Cc2ccc(cc2)C(F)(F)F)C1=O