Reaction Details
TargetGlutamate receptor ionotropic, NMDA 2B
LigandBDBM198837
Substrate/Competitorn/a
Meas. Tech.Radioligand Binding Assay
Temperature323.15±n/a K
Ki 2.9±n/a nM
Commentsextracted
Citation King, DThompson, III, LAShi, JThangathirupathy, SWarrier, JSIslam, IMacor, JE Selective NR2B antagonists US Patent US9221796 Publication Date 12/29/2015
 
Glutamate receptor ionotropic, NMDA 2B
Name:Glutamate receptor ionotropic, NMDA 2B
Type:Protein
Mol. Mass.:166077.66
Organism:Rattus norvegicus (Rat)
Description:Q00960
Residue:1482
BDBM198837
NameBDBM198837
Synonyms:US9221796, 117, P-2
TypeSmall organic molecule
Emp. Form.C23H24F4N2O2
Mol. Mass.436.4425
SMILESOc1ccc(cc1F)[C@@H]1CCN(C[C@H]1F)[C@@H]1CCN(Cc2ccc(cc2)C(F)F)C1=O