Reaction Details
TargetMacrophage colony-stimulating factor 1 receptor [555-568]
LigandBDBM198883
Substrate/Competitorn/a
Meas. Tech.Fluorescence Polarization Competition Immunoassay
pH7.5±n/a
IC50 1.6±n/a nM
Commentsextracted
Citation Illig, CRBallentine, SKChen, JDesjarlais, RLMeegalla, SKWall, MWilson, K Inhibitors of c-fms kinase US Patent US9221797 Publication Date 12/29/2015
 
Macrophage colony-stimulating factor 1 receptor [555-568]
Name:Macrophage colony-stimulating factor 1 receptor [555-568]
Type:Peptide
Mol. Mass.:1619.64
Organism:Homo sapiens (Human)
Description:P07333 aa 555-568
Residue:14
SYEGNSYTFIDPTQ
BDBM198883
NameBDBM198883
Synonyms:US9221797, 68
TypeSmall organic molecule
Emp. Form.C21H23N5O
Mol. Mass.361.4402
SMILESCNCC(=C)c1ccc(NC(=O)c2nc(c[nH]2)C#N)c(c1)C1=CCCCC1