Reaction Details
TargetMacrophage colony-stimulating factor 1 receptor [555-568]
LigandBDBM198906
Substrate/Competitorn/a
Meas. Tech.Fluorescence Polarization Competition Immunoassay
pH7.5±n/a
IC50 1.5±n/a nM
Commentsextracted
Citation Illig, CRBallentine, SKChen, JDesjarlais, RLMeegalla, SKWall, MWilson, K Inhibitors of c-fms kinase US Patent US9221797 Publication Date 12/29/2015
 
Macrophage colony-stimulating factor 1 receptor [555-568]
Name:Macrophage colony-stimulating factor 1 receptor [555-568]
Type:Peptide
Mol. Mass.:1619.64
Organism:Homo sapiens (Human)
Description:P07333 aa 555-568
Residue:14
SYEGNSYTFIDPTQ
BDBM198906
NameBDBM198906
Synonyms:US9221797, 149
TypeSmall organic molecule
Emp. Form.C27H35N5O
Mol. Mass.445.5997
SMILESCC1CCCC(=C1C)c1cc(ccc1NC(=O)c1nc(c[nH]1)C#N)C(C)(C)N1CCCCC1