Reaction Details
TargetHepatocyte growth factor receptor
LigandBDBM98028
Substrate/Competitorn/a
Meas. Tech.Kinase Enzyme Assay
pH7.5±n/a
Temperature303.15±n/a K
IC50 0.55±n/a nM
Commentsextracted
Citation Zhuo, JHe, CYao, W Imidazo[1,2-B][1,2,4]triazines as c-Met inhibitors US Patent US9221824 Publication Date 12/29/2015
 
Hepatocyte growth factor receptor
Name:Hepatocyte growth factor receptor
Type:Protein
Mol. Mass.:155559.73
Organism:Homo sapiens (Human)
Description:P08581
Residue:1390
BDBM98028
NameBDBM98028
Synonyms:US10472367, Compound Formula II US8487096, II | US9221824, Formula II
TypeSmall organic molecule
Emp. Form.C23H17ClN6O
Mol. Mass.428.874
SMILESCNC(=O)c1ccc(cc1Cl)-c1cnc2ncc(Cc3ccc4ncccc4c3)n2n1