Reaction Details
TargetHepatocyte growth factor receptor
LigandBDBM98029
Substrate/Competitorn/a
Meas. Tech.Kinase Enzyme Assay
pH7.5±n/a
Temperature303.15±n/a K
IC50 0.55±n/a nM
Commentsextracted
Citation Zhuo, JHe, CYao, W Imidazo[1,2-B][1,2,4]triazines as c-Met inhibitors US Patent US9221824 Publication Date 12/29/2015
 
Hepatocyte growth factor receptor
Name:Hepatocyte growth factor receptor
Type:Protein
Mol. Mass.:155559.73
Organism:Homo sapiens (Human)
Description:P08581
Residue:1390
BDBM98029
NameBDBM98029
Synonyms:US10472367, Compound Formula III US8487096, III | US9221824, Formula III
TypeSmall organic molecule
Emp. Form.C27H21ClN8O2
Mol. Mass.524.961
SMILESC[C@H](NC(=O)c1ccc(cc1Cl)-c1cnc2ncc(Cc3ccc4ncccc4c3)n2n1)c1noc(C)n1