Reaction Details
TargetHepatocyte growth factor receptor
LigandBDBM98031
Substrate/Competitorn/a
Meas. Tech.Kinase Enzyme Assay
pH7.5±n/a
Temperature303.15±n/a K
IC50 0.55±n/a nM
Commentsextracted
Citation Zhuo, JHe, CYao, W Imidazo[1,2-B][1,2,4]triazines as c-Met inhibitors US Patent US9221824 Publication Date 12/29/2015
 
Hepatocyte growth factor receptor
Name:Hepatocyte growth factor receptor
Type:Protein
Mol. Mass.:155559.73
Organism:Homo sapiens (Human)
Description:P08581
Residue:1390
BDBM98031
NameBDBM98031
Synonyms:US10472367, Compound Formula V US8487096, V | US9221824, Formula V
TypeSmall organic molecule
Emp. Form.C24H20N6O
Mol. Mass.408.4552
SMILESCNC(=O)c1ccc(cc1C)-c1cnc2ncc(Cc3ccc4ncccc4c3)n2n1