Reaction Details
TargetSerine/threonine-protein kinase Sgk1
LigandBDBM50443628
Substrate/Competitorn/a
Meas. Tech.Enzymatic Activity Assay
pH7.4±n/a
Temperature297.15±n/a K
IC50 1±n/a nM
Commentsextracted
Citation Nazare, MHalland, NSchmidt, FWeiss, TDietz, UHofmeister, ACarry, J N-[4-(1H-pyrazolo[3,4-b]pyrazin-6-yl)phenyl]sulfonamides as pharmaceuticals US Patent US9221828 Publication Date 12/29/2015
 
Serine/threonine-protein kinase Sgk1
Name:Serine/threonine-protein kinase Sgk1
Type:Other Protein Type
Mol. Mass.:48954.40
Organism:Homo sapiens (Human)
Description:Recombinant human SGK-1 enzyme produced in a baculovirus system.
Residue:431
BDBM50443628
NameBDBM50443628
Synonyms:CHEMBL3092468 US9221828, 35
TypeSmall organic molecule
Emp. Form.C17H12ClFN6O2S
Mol. Mass.418.833
SMILESNc1n[nH]c2nc(cnc12)-c1ccc(NS(=O)(=O)c2cc(Cl)ccc2F)cc1