Reaction Details
TargetSerine/threonine-protein kinase Sgk1
LigandBDBM50043783
Substrate/Competitorn/a
Meas. Tech.Enzymatic Activity Assay
pH7.4±n/a
Temperature297.15±n/a K
IC50 2±n/a nM
Commentsextracted
Citation Nazare, MHalland, NSchmidt, FWeiss, TDietz, UHofmeister, ACarry, J N-[4-(1H-pyrazolo[3,4-b]pyrazin-6-yl)phenyl]sulfonamides as pharmaceuticals US Patent US9221828 Publication Date 12/29/2015
 
Serine/threonine-protein kinase Sgk1
Name:Serine/threonine-protein kinase Sgk1
Type:Other Protein Type
Mol. Mass.:48954.40
Organism:Homo sapiens (Human)
Description:Recombinant human SGK-1 enzyme produced in a baculovirus system.
Residue:431
BDBM50043783
NameBDBM50043783
Synonyms:CHEMBL3356053 US9221828, 46
TypeSmall organic molecule
Emp. Form.C19H15N7O3S
Mol. Mass.421.433
SMILESCOc1ccc(C#N)c(c1)S(=O)(=O)Nc1ccc(cc1)-c1cnc2c(N)n[nH]c2n1