Reaction Details
TargetTyrosine--tRNA ligase
LigandBDBM199134
Substrate/Competitorn/a
Meas. Tech.In vitro Enzyme Inhibition Assay
pH7.9±n/a
IC50 9.2e+2± 2.6e+2 nM
Commentsextracted
Citation Chen, LWWang, PFTang, DJTao, XXMan, RJQiu, HYWang, ZCXu, CZhu, HL Metronidazole containing pyrazole derivatives potently inhibit tyrosyl-tRNA synthetase: design, synthesis, and biological evaluation. Chem Biol Drug Des88:592-8 (2016) 
 
Tyrosine--tRNA ligase
Name:Tyrosine--tRNA ligase
Type:Protein
Mol. Mass.:47586.43
Organism:Staphylococcus aureus (strain MSSA476)
Description:n/a
Residue:420
BDBM199134
NameBDBM199134
Synonyms:2-(2-Methyl-5-nitro-1H-imidazol-1-yl)-ethyl-5-(4-methoxyphenyl)-1-phenyl-1H-pyrazole-3-carboxylate (4f)
TypeSmall organic molecule
Emp. Form.C23H21N5O5
Mol. Mass.447.4433
SMILESCOc1ccc(cc1)-c1cc(nn1-c1ccccc1)C(=O)OCCn1c(C)ncc1[N+]([O-])=O