Reaction Details
TargetTyrosine--tRNA ligase
LigandBDBM199144
Substrate/Competitorn/a
Meas. Tech.In vitro Enzyme Inhibition Assay
pH7.9±n/a
IC50 4.55e+3± 1.1e+2 nM
Commentsextracted
Citation Chen, LWWang, PFTang, DJTao, XXMan, RJQiu, HYWang, ZCXu, CZhu, HL Metronidazole containing pyrazole derivatives potently inhibit tyrosyl-tRNA synthetase: design, synthesis, and biological evaluation. Chem Biol Drug Des88:592-8 (2016) 
 
Tyrosine--tRNA ligase
Name:Tyrosine--tRNA ligase
Type:Protein
Mol. Mass.:47586.43
Organism:Staphylococcus aureus (strain MSSA476)
Description:n/a
Residue:420
BDBM199144
NameBDBM199144
Synonyms:2-(2-Methyl-5-nitro-1H-imidazol-1-yl)-ethyl-1-phenyl-5-(o-tolyl)-1H-pyrazole-3-carboxylate (4p)
TypeSmall organic molecule
Emp. Form.C23H21N5O4
Mol. Mass.431.4439
SMILESCc1ncc(n1CCOC(=O)c1cc(-c2ccccc2C)n(n1)-c1ccccc1)[N+]([O-])=O