Reaction Details
TargetProtein mono-ADP-ribosyltransferase PARP16 [1-280]
LigandBDBM199181
Substrate/Competitorn/a
Meas. Tech.Enzymatic Activity Assay
IC50 4.17e+3±n/a nM
Citation Venkannagari, HVerheugd, PKoivunen, JHaikarainen, TObaji, EAshok, YNarwal, MPihlajaniemi, TLüscher, BLehtiö, L Small-Molecule Chemical Probe Rescues Cells from Mono-ADP-Ribosyltransferase ARTD10/PARP10-Induced Apoptosis and Sensitizes Cancer Cells to DNA Damage. Cell Chem Biol23:1251-1260 (2016) 
 
Protein mono-ADP-ribosyltransferase PARP16 [1-280]
Name:Protein mono-ADP-ribosyltransferase PARP16 [1-280]
Type:n/a
Mol. Mass.:31385.07
Organism:Homo sapiens (Human)
Description:Q8N5Y8 (1-280 aa)
Residue:280
BDBM199181
NameBDBM199181
Synonyms:4-[(4-Carbamoylcyclohexyl)oxy]cyclohexane-1-carboxamide (OUL35)
TypeSmall organic molecule
Emp. Form.C14H12N2O3
Mol. Mass.256.2567
SMILESNC(=O)c1ccc(Oc2ccc(cc2)C(N)=O)cc1