Reaction Details
TargetEndothelial lipase
LigandBDBM199227
Substrate/Competitorn/a
Meas. Tech.Endothelial Lipase Assay
pH7.2±n/a
IC50 1195±n/a nM
Commentsextracted
Citation Connelly, MAGreco, MYe, H Tricyclic indole derivatives useful endothelial lipase inhibitors US Patent US9216998 Publication Date 12/22/2015
 
Endothelial lipase
Name:Endothelial lipase
Type:Protein
Mol. Mass.:56643.58
Organism:Mus musculus (Mouse)
Description:Q9WVG5
Residue:500
BDBM199227
NameBDBM199227
Synonyms:US9216998, 11
TypeSmall organic molecule
Emp. Form.C22H22F3N
Mol. Mass.357.412
SMILESFC(F)(F)c1c(CCCc2ccccc2)n2CCCCc3cccc1c23