Reaction Details
TargetEndothelial lipase
LigandBDBM199211
Substrate/Competitorn/a
Meas. Tech.Endothelial Lipase Assay
pH7.2±n/a
IC50 1001±n/a nM
Commentsextracted
Citation Connelly, MAGreco, MYe, H Tricyclic indole derivatives useful endothelial lipase inhibitors US Patent US9216998 Publication Date 12/22/2015
 
Endothelial lipase
Name:Endothelial lipase
Type:Protein
Mol. Mass.:56643.58
Organism:Mus musculus (Mouse)
Description:Q9WVG5
Residue:500
BDBM199211
NameBDBM199211
Synonyms:US9216998, 16
TypeSmall organic molecule
Emp. Form.C24H26F3N3O
Mol. Mass.429.4779
SMILESCN(C)CC(=O)N1CCn2c(CCc3ccccc3)c(c3cccc(C1)c23)C(F)(F)F