Reaction Details
TargetEndothelial lipase
LigandBDBM199228
Substrate/Competitorn/a
Meas. Tech.Endothelial Lipase Assay
pH7.2±n/a
IC50 618±n/a nM
Commentsextracted
Citation Connelly, MAGreco, MYe, H Tricyclic indole derivatives useful endothelial lipase inhibitors US Patent US9216998 Publication Date 12/22/2015
 
Endothelial lipase
Name:Endothelial lipase
Type:Protein
Mol. Mass.:56643.58
Organism:Mus musculus (Mouse)
Description:Q9WVG5
Residue:500
BDBM199228
NameBDBM199228
Synonyms:US9216998, 26
TypeSmall organic molecule
Emp. Form.C20H18F3NO
Mol. Mass.345.3582
SMILESFC(F)(F)c1c(CCCc2ccccc2)n2CCOc3cccc1c23