Reaction Details
TargetKappa-type opioid receptor
LigandBDBM199419
Substrate/Competitorn/a
Meas. Tech.Radioligand Dose-Displacement Binding Assay
pH7.4±n/a
Ki 0.06±0.01 nM
Commentsextracted
Citation Kyle, DJTafesse, L Buprenorphine analogs US Patent US9221831 Publication Date 12/29/2015
 
Kappa-type opioid receptor
Name:Kappa-type opioid receptor
Type:G Protein-Coupled Receptor (GPCR)
Mol. Mass.:42648.76
Organism:Homo sapiens (Human)
Description:P41145
Residue:380
BDBM199419
NameBDBM199419
Synonyms:US9221831, 85
TypeSmall organic molecule
Emp. Form.C30H42N2O5
Mol. Mass.510.6649
SMILESCC[C@H](C)[C@H](N)C(=O)OC[C@H]1C[C@]23CC[C@]1(OC)[C@@H]1Oc4c5c(C[C@H]2N(CC2CC2)CC[C@@]315)ccc4O