Reaction Details
TargetKappa-type opioid receptor
LigandBDBM199425
Substrate/Competitorn/a
Meas. Tech.Radioligand Dose-Displacement Binding Assay
pH7.4±n/a
Ki 0.11±0.02 nM
Commentsextracted
Citation Kyle, DJTafesse, L Buprenorphine analogs US Patent US9221831 Publication Date 12/29/2015
 
Kappa-type opioid receptor
Name:Kappa-type opioid receptor
Type:G Protein-Coupled Receptor (GPCR)
Mol. Mass.:42648.76
Organism:Homo sapiens (Human)
Description:P41145
Residue:380
BDBM199425
NameBDBM199425
Synonyms:US9221831, 91
TypeSmall organic molecule
Emp. Form.C33H41N3O5
Mol. Mass.559.6957
SMILESCNC(=O)Nc1cccc(COC[C@H]2C[C@]34CC[C@]2(OC)[C@@H]2Oc5c6c(C[C@H]3N(CC3CC3)CC[C@@]426)ccc5O)c1