Reaction Details
TargetMitogen-activated protein kinase 1
LigandBDBM199741
Substrate/Competitorn/a
Meas. Tech.IMAP-FP Assay
IC50 0.4±n/a nM
Citation Wilson, KJWitter, DJDaniels, MHAngeles, ARSiliphaivanh, PSloman, DO'Boyle, BFalcone, DWhite, CFerguson, RZhou, WLipford, KMansoor, UFFevrier, SHuang, XKurukulasuriya, RRichard, JETang, SBoyce, CKozlowski, JBakshi, RKKarunakaran, GB Compounds that are ERK inhibitors US Patent US9226922 Publication Date 1/5/2016
 
Mitogen-activated protein kinase 1
Name:Mitogen-activated protein kinase 1
Type:Ser/Thr Protein Kinase
Mol. Mass.:41392.76
Organism:Homo sapiens (Human)
Description:P28482
Residue:360
BDBM199741
NameBDBM199741
Synonyms:US9226922, 377
TypeSmall organic molecule
Emp. Form.C20H24FN5O4
Mol. Mass.417.4341
SMILESCOc1n[nH]c2cc(NC(=O)N[C@@H](c3ccc(F)c(C)c3)C(C)(C)O)nc(CO)c12