Reaction Details
TargetMitogen-activated protein kinase 1
LigandBDBM199923
Substrate/Competitorn/a
Meas. Tech.IMAP-FP Assay
IC50 0.6±n/a nM
Citation Wilson, KJWitter, DJDaniels, MHAngeles, ARSiliphaivanh, PSloman, DO'Boyle, BFalcone, DWhite, CFerguson, RZhou, WLipford, KMansoor, UFFevrier, SHuang, XKurukulasuriya, RRichard, JETang, SBoyce, CKozlowski, JBakshi, RKKarunakaran, GB Compounds that are ERK inhibitors US Patent US9226922 Publication Date 1/5/2016
 
Mitogen-activated protein kinase 1
Name:Mitogen-activated protein kinase 1
Type:Ser/Thr Protein Kinase
Mol. Mass.:41392.76
Organism:Homo sapiens (Human)
Description:P28482
Residue:360
BDBM199923
NameBDBM199923
Synonyms:US9226922, 560
TypeSmall organic molecule
Emp. Form.C20H25N5O4
Mol. Mass.399.4436
SMILESCOCCOc1n[nH]c2cc(NC(=O)N[C@@H](c3ccccc3)C(C)(C)O)ncc12