Reaction Details
TargetALK tyrosine kinase receptor [C1156Y]
LigandBDBM50306682
Substrate/Competitorn/a
Meas. Tech.Inhibition Assay
IC50<1.2±n/a nM
Citation Wang, ZLi, LWang, Z Spirocyclic molecules as protein kinase inhibitors US Patent US9226923 Publication Date 1/5/2016
 
ALK tyrosine kinase receptor [C1156Y]
Name:ALK tyrosine kinase receptor [C1156Y]
Type:Protein
Mol. Mass.:176463.11
Organism:Homo sapiens (Human)
Description:Q9UM73 (C1156Y)
Residue:1620
BDBM50306682
NameBDBM50306682
Synonyms:(R)-3-(1-(2,6-dichloro-3-fluorophenyl)ethoxy)-5-(1-(piperidin-4-yl)-1H-pyrazol-4-yl)pyridin-2-amine 3-[(1R)-1-(2,6-dichloro-3-fluorophenyl)ethoxy]-5-(1-piperidin-4-yl-1H-pyrazol-4-yl)pyridin-2-amine CRIZOTINIB US10370379, Crizotinib US10780082, Compound Crizotinib US11517561, Compound Crizotinib US9199944, Crizotinib | US9226923, Crizotinib
TypeSmall organic molecule
Emp. Form.C21H22Cl2FN5O
Mol. Mass.450.337
SMILESC[C@@H](Oc1cc(cnc1N)-c1cnn(c1)C1CCNCC1)c1c(Cl)ccc(F)c1Cl