Reaction Details
TargetSerine protease 1
LigandBDBM158140
Substrate/Competitorn/a
Meas. Tech.Trypsin Inhibition Assay
pH8±n/a
Ki 0.21±n/a nM
Commentsextracted
Citation Koshiba, TTokumasu, MIchimaru, TOhsumi, KNakagawa, TYamada, TMatsumoto, KSuzuki, T Heteroarylcarboxylic acid ester derivative US Patent US9227949 Publication Date 1/5/2016
 
Serine protease 1
Name:Serine protease 1
Type:Enzyme
Mol. Mass.:26557.80
Organism:Homo sapiens (Human)
Description:P07477
Residue:247
BDBM158140
NameBDBM158140
Synonyms:US9024044, 68 US9655879, 68
TypeSmall organic molecule
Emp. Form.C25H22FN3O7S
Mol. Mass.527.521
SMILESCC(C)(Cc1ccc(s1)C(=O)Oc1ccc(cc1F)C(N)=N)C(=O)Nc1ccc(C(O)=O)c(c1)C(O)=O