Reaction Details
TargetIsoform 1 of Metabotropic glutamate receptor 5 (5a)
LigandBDBM199990
Substrate/Competitorn/a
Meas. Tech.Binding Assay
pH7.4±n/a
Ki 67±0.0 nM
Commentsextracted
Citation Jaeschke, GLindemann, LRicci, ARueher, DStadler, HVieira, E Ethynyl derivatives US Patent US9227959 Publication Date 1/5/2016
 
Isoform 1 of Metabotropic glutamate receptor 5 (5a)
Name:Isoform 1 of Metabotropic glutamate receptor 5 (5a)
Type:Enzyme
Mol. Mass.:128885.13
Organism:Homo sapiens (Human)
Description:P41594-2
Residue:1180
BDBM199990
NameBDBM199990
Synonyms:US9227959, 4
TypeSmall organic molecule
Emp. Form.C19H18ClN3O2
Mol. Mass.355.818
SMILESCC1(C)COCCN1C(=O)c1ncc(cn1)C#Cc1cccc(Cl)c1