Reaction Details
TargetKallikrein-1
LigandBDBM200010
Substrate/Competitorn/a
Meas. Tech.In Vitro Inhibition Assay
IC50>1000±n/a nM
Citation Evans, DMDavie, RLEdwards, HJRooker, DP Benzylamine derivatives as inhibitors of plasma kallikrein US Patent US9234000 Publication Date 1/12/2016
 
Kallikrein-1
Name:Kallikrein-1
Type:Enzyme
Mol. Mass.:28874.69
Organism:Homo sapiens (Human)
Description:P06870
Residue:262
BDBM200010
NameBDBM200010
Synonyms:US9234000, 1
TypeSmall organic molecule
Emp. Form.C31H38N4O4
Mol. Mass.530.6578
SMILESCCOc1ccc(CC(=O)CNN([C@@H](Cc2ccccc2)C(=O)NCc2ccc(CN)cc2)C(=O)CC)cc1