Reaction Details
TargetAldo-keto reductase family 1 member B10 [K125R,V301L]
LigandBDBM200220
Substrate/Competitorn/a
Meas. Tech.IC50-Activity Assay (AR)
pH7±n/a
IC50 1.0e+3±n/a nM
Commentsextracted
Citation Cousido-Siah, ARuiz, FXFranflík, JGiménez-Dejoz, JMitschler, AKamlar, MVesely´, JAjani, HParés, XFarrés, JHobza, PPodjarny, AD IDD388 Polyhalogenated Derivatives as Probes for an Improved Structure-Based Selectivity of AKR1B10 Inhibitors ACS Chem Biol11:2693-2705 (2016) 
 
Aldo-keto reductase family 1 member B10 [K125R,V301L]
Name:Aldo-keto reductase family 1 member B10 [K125R,V301L]
Type:Protein
Mol. Mass.:36066.71
Organism:Homo sapiens (Human)
Description:Methylated form of AKR1B10 with mutations K125R and V301L; 4XLJ; 4XLK; 4XM9; 4XLM; 4XMJ; 4XZL; 4WEV
Residue:316
BDBM200220
NameBDBM200220
Synonyms:2-(5-chloro-2-((2,4,6-tribromobenzyl)carbamoyl)phenoxy)acetic acid | MK184
TypeSmall organic molecule
Emp. Form.C16H11Br3ClNO4
Mol. Mass.556.428
SMILESOC(=O)COc1cc(Cl)ccc1C(=O)NCc1c(Br)cc(Br)cc1Br