Reaction Details
TargetAldo-keto reductase family 1 member B10 [K125R,V301L]
LigandBDBM200221
Substrate/Competitorn/a
Meas. Tech.IC50-Activity Assay (AR)
pH7±n/a
IC50 80±n/a nM
Commentsextracted
Citation Cousido-Siah, ARuiz, FXFranflík, JGiménez-Dejoz, JMitschler, AKamlar, MVesely´, JAjani, HParés, XFarrés, JHobza, PPodjarny, AD IDD388 Polyhalogenated Derivatives as Probes for an Improved Structure-Based Selectivity of AKR1B10 Inhibitors ACS Chem Biol11:2693-2705 (2016) 
 
Aldo-keto reductase family 1 member B10 [K125R,V301L]
Name:Aldo-keto reductase family 1 member B10 [K125R,V301L]
Type:Protein
Mol. Mass.:36066.71
Organism:Homo sapiens (Human)
Description:Methylated form of AKR1B10 with mutations K125R and V301L; 4XLJ; 4XLK; 4XM9; 4XLM; 4XMJ; 4XZL; 4WEV
Residue:316
BDBM200221
NameBDBM200221
Synonyms:2-(5-chloro-2-(((perbromophenyl)methyl)carbamoyl)phenoxy)acetic acid | MK204
TypeSmall organic molecule
Emp. Form.C16H9Br5ClNO4
Mol. Mass.714.22
SMILESOC(=O)COc1cc(Cl)ccc1C(=O)NCc1c(Br)c(Br)c(Br)c(Br)c1Br