Reaction Details
TargetProprotein convertase subtilisin/kexin type 9
LigandBDBM200329
Substrate/Competitorn/a
Meas. Tech.AlphaLISA Assay
IC50 4500±n/a nM
Citation Darout, EDullea, RHawkins, JJLondregan, ATLoria, PMMaguire, BMcClure, KFPetersen, DNPiotrowski, DW Substituted amide compounds US Patent US9227956 Publication Date 1/5/2016
 
Proprotein convertase subtilisin/kexin type 9
Name:Proprotein convertase subtilisin/kexin type 9
Type:Enzyme
Mol. Mass.:74286.93
Organism:Homo sapiens (Human)
Description:Q8NBP7
Residue:692
BDBM200329
NameBDBM200329
Synonyms:US9227956, 14
TypeSmall organic molecule
Emp. Form.C30H34N6O6
Mol. Mass.574.6276
SMILESCCOC(=O)OC(C)OC(=O)c1c(cnn1C)-c1ccc(cc1)C(=O)N([C@@H]1CCCNC1)c1nccc2ccn(C)c12