Reaction Details
TargetProprotein convertase subtilisin/kexin type 9
LigandBDBM200330
Substrate/Competitorn/a
Meas. Tech.AlphaLISA Assay
IC50 7300±n/a nM
Citation Darout, EDullea, RHawkins, JJLondregan, ATLoria, PMMaguire, BMcClure, KFPetersen, DNPiotrowski, DW Substituted amide compounds US Patent US9227956 Publication Date 1/5/2016
 
Proprotein convertase subtilisin/kexin type 9
Name:Proprotein convertase subtilisin/kexin type 9
Type:Enzyme
Mol. Mass.:74286.93
Organism:Homo sapiens (Human)
Description:Q8NBP7
Residue:692
BDBM200330
NameBDBM200330
Synonyms:US9227956, 15a
TypeSmall organic molecule
Emp. Form.C27H30ClN5O6
Mol. Mass.556.01
SMILESCCOC(=O)O[C@@H](C)OC(=O)c1c(cnn1C)-c1ccc(cc1)C(=O)N([C@@H]1CCCNC1)c1ncccc1Cl