Reaction Details
TargetProprotein convertase subtilisin/kexin type 9
LigandBDBM200325
Substrate/Competitorn/a
Meas. Tech.Cell Free Assay
IC50 640±n/a nM
Citation Darout, EDullea, RHawkins, JJLondregan, ATLoria, PMMaguire, BMcClure, KFPetersen, DNPiotrowski, DW Substituted amide compounds US Patent US9227956 Publication Date 1/5/2016
 
Proprotein convertase subtilisin/kexin type 9
Name:Proprotein convertase subtilisin/kexin type 9
Type:Enzyme
Mol. Mass.:74286.93
Organism:Homo sapiens (Human)
Description:Q8NBP7
Residue:692
BDBM200325
NameBDBM200325
Synonyms:US9227956, 10
TypeSmall organic molecule
Emp. Form.C23H24ClN5O3
Mol. Mass.453.921
SMILESCOC(=O)c1c(cnn1C)-c1ccc(cc1)C(=O)N([C@@H]1CCCNC1)c1ncccc1Cl