Reaction Details
TargetProprotein convertase subtilisin/kexin type 9
LigandBDBM200327
Substrate/Competitorn/a
Meas. Tech.Cell Free Assay
IC50 1700±n/a nM
Citation Darout, EDullea, RHawkins, JJLondregan, ATLoria, PMMaguire, BMcClure, KFPetersen, DNPiotrowski, DW Substituted amide compounds US Patent US9227956 Publication Date 1/5/2016
 
Proprotein convertase subtilisin/kexin type 9
Name:Proprotein convertase subtilisin/kexin type 9
Type:Enzyme
Mol. Mass.:74286.93
Organism:Homo sapiens (Human)
Description:Q8NBP7
Residue:692
BDBM200327
NameBDBM200327
Synonyms:US9227956, 12
TypeSmall organic molecule
Emp. Form.C25H26N6O3
Mol. Mass.458.5123
SMILESCn1ncc(c1C(O)=O)-c1ccc(cc1)C(=O)N([C@@H]1CCCNC1)c1nccc2ccn(C)c12